test: only launch from-forge when triggered from another project

1 job for branch/default in 1 minute and 13 seconds (queued for 12 seconds)
Status Job ID Name Coverage
failed #39811
triggered allowed to fail


Name Stage Failure
py3-from-forge Tests
FAILED test/test_domains.py::AbstractDomainTC::testEmptyDomain - NotImplement...
FAILED test/test_domains.py::AbstractDomainTC::testGetValues - NotImplemented...
FAILED test/test_domains.py::AbstractDomainTC::testRemove - NotImplementedError
FAILED test/test_domains.py::AbstractDomainTC::testSize - NotImplementedError
================= 15 failed, 156 passed, 6 warnings in 13.12s ==================
ERROR: InvocationError for command /builds/open-source/logilab-constraint/.tox/py3-from-forge/bin/python -m pytest test (exited with code 1)
___________________________________ summary ____________________________________
ERROR: py3-from-forge: commands failed
ERROR: Job failed: command terminated with exit code 1