Added tag 3.32.6 for changeset 1760297db780

--HG--
branch : 3.32
9 jobs for branch/3.32 in 10 minutes and 12 seconds (queued for 14 minutes and 2 seconds)
Status Name Job ID Coverage
  Lint
passed black #398917

00:03:47

failed build_doc #398919
allowed to fail

00:07:52

passed check-manifest #398916

00:03:46

passed doc8 #398918

00:09:00

passed flake8 #398915

00:03:50

 
  Tests
failed py3-misc #398922

00:00:37

failed py3-server #398920

00:00:37

failed py3-web #398921

00:01:08

failed test-cube-skeleton #398923

00:00:37

 
Name Stage Failure
failed
test-cube-skeleton Tests There has been a runner system failure, please try again
Running with gitlab-runner hpd-0.4.0 (e7173c85861f)
on runner-gitlab-runner-5b57d5ccf5-25xmd xxtUc89W
Preparing the "kubernetes" executor
Using Kubernetes namespace: gitlab-managed-apps
Using Kubernetes executor with image python:latest ...
Preparing environment
Waiting for pod gitlab-managed-apps/runner-xxtuc89w-project-385-concurrent-3btxkq to be running, status is Pending
Waiting for pod gitlab-managed-apps/runner-xxtuc89w-project-385-concurrent-3btxkq to be running, status is Pending
ERROR: Job failed (system failure): prepare environment: error dialing backend: dial timeout, backstop. Check https://docs.gitlab.com/runner/shells/index.html#shell-profile-loading for more information
failed
py3-misc Tests There has been a runner system failure, please try again
Running with gitlab-runner hpd-0.4.0 (e7173c85861f)
on runner-gitlab-runner-5b57d5ccf5-25xmd xxtUc89W
Preparing the "kubernetes" executor
Using Kubernetes namespace: gitlab-managed-apps
Using Kubernetes executor with image registry.logilab.fr/logilab/infra/dockerfiles/debian-buster-slim-pg11 ...
Preparing environment
Waiting for pod gitlab-managed-apps/runner-xxtuc89w-project-385-concurrent-2ms6fg to be running, status is Pending
Waiting for pod gitlab-managed-apps/runner-xxtuc89w-project-385-concurrent-2ms6fg to be running, status is Pending
ERROR: Job failed (system failure): prepare environment: error dialing backend: dial timeout, backstop. Check https://docs.gitlab.com/runner/shells/index.html#shell-profile-loading for more information
failed
py3-web Tests There has been a runner system failure, please try again
Preparing environment
Waiting for pod gitlab-managed-apps/runner-xxtuc89w-project-385-concurrent-1sm2sq to be running, status is Pending
Waiting for pod gitlab-managed-apps/runner-xxtuc89w-project-385-concurrent-1sm2sq to be running, status is Pending
Running on runner-xxtuc89w-project-385-concurrent-1sm2sq via runner-gitlab-runner-5b57d5ccf5-25xmd...
Getting source from version control
Uploading artifacts for failed job
/bin/bash: line 118: cd: /builds/cubicweb/cubicweb: No such file or directory
Cleaning up file based variables
ERROR: Job failed (system failure): error dialing backend: dial timeout, backstop
failed
py3-server Tests There has been a runner system failure, please try again
Running with gitlab-runner hpd-0.4.0 (e7173c85861f)
on runner-gitlab-runner-5b57d5ccf5-25xmd xxtUc89W
Preparing the "kubernetes" executor
Using Kubernetes namespace: gitlab-managed-apps
Using Kubernetes executor with image registry.logilab.fr/logilab/infra/dockerfiles/debian-buster-slim-pg11 ...
Preparing environment
Waiting for pod gitlab-managed-apps/runner-xxtuc89w-project-385-concurrent-0wvm2d to be running, status is Pending
Waiting for pod gitlab-managed-apps/runner-xxtuc89w-project-385-concurrent-0wvm2d to be running, status is Pending
ERROR: Job failed (system failure): prepare environment: error dialing backend: dial timeout, backstop. Check https://docs.gitlab.com/runner/shells/index.html#shell-profile-loading for more information
failed
build_doc Lint
ERROR: Could not find a version that satisfies the requirement rdflib-jsonld<0.6.0 (from cubicweb[pyramid]) (from versions: 0.2, 0.3, 0.4.0, 0.5.0, 0.6.0, 0.6.1, 0.6.2)
ERROR: No matching distribution found for rdflib-jsonld<0.6.0

=================================== log end ====================================
ERROR: could not install deps [sphinx, -r/builds/cubicweb/cubicweb/requirements/doc.txt]; v = InvocationError('/builds/cubicweb/cubicweb/.tox/doc/bin/python -m pip install sphinx -r/builds/cubicweb/cubicweb/requirements/doc.txt', 1)
___________________________________ summary ____________________________________
ERROR: doc: could not install deps [sphinx, -r/builds/cubicweb/cubicweb/requirements/doc.txt]; v = InvocationError('/builds/cubicweb/cubicweb/.tox/doc/bin/python -m pip install sphinx -r/builds/cubicweb/cubicweb/requirements/doc.txt', 1)
Cleaning up file based variables
ERROR: Job failed: command terminated with exit code 1