fix: do not ignore files *ve*

--HG--
branch : 3.27
5 jobs for branch/3.27 in 24 minutes and 46 seconds (queued for 13 seconds)
Name Stage Failure
failed
lint_py Lint
cubicweb/test/data/libpython/cubicweb_mycube/__pkginfo__.py:0: [E902] FileNotFoundError: [Errno 2] No such file or directory: 'cubicweb/test/data/libpython/cubicweb_mycube/__pkginfo__.py'
cubicweb/test/unittest_cwctl.py:57: [E741] ambiguous variable name 'l'
cubicweb/web/views/autoform.py:736: [E741] ambiguous variable name 'l'
ERROR: InvocationError for command /bin/sh -c 'flake8 `xargs -a /builds/cubicweb/cubicweb/flake8-ok-files.txt`' (exited with code 1)
___________________________________ summary ____________________________________
ERROR: flake8: commands failed
Running after_script
Uploading artifacts for failed job
ERROR: Job failed: command terminated with exit code 1
failed
py3_misc Tests
FAILED cubicweb/devtools/test/unittest_devctl.py::DevCtlTC::test_flake8 - Ass...
FAILED cubicweb/devtools/test/unittest_qunit.py::QUnitTestCaseTC::test_javascripts
= 2 failed, 580 passed, 15 skipped, 1 xfailed, 1 xpassed, 88 warnings in 607.91s (0:10:07) =
ERROR: InvocationError for command '/builds/cubicweb/cubicweb/.tox/py3-misc/bin/python -m pytest /builds/cubicweb/cubicweb/cubicweb/test /builds/cubicweb/cubicweb/cubicweb/dataimport/test /builds/cubicweb/cubicweb/cubicweb/devtools/test /builds/cubicweb/cubicweb/cubicweb/entities/test /builds/cubicweb/cubicweb/cubicweb/ext/test /builds/cubicweb/cubicweb/cubicweb/hooks/test /builds/cubicweb/cubicweb/cubicweb/sobjects/test /builds/cubicweb/cubicweb/cubicweb/wsgi/test /builds/cubicweb/cubicweb/cubicweb/pyramid/test' (exited with code 1)
___________________________________ summary ____________________________________
ERROR: py3-misc: commands failed
Running after_script
Uploading artifacts for failed job
ERROR: Job failed: command terminated with exit code 1
failed
py3_web Tests
FAILED cubicweb/web/test/test_jscript.py::JScript::test_javascripts - Excepti...
FAILED cubicweb/web/test/unittest_propertysheet.py::PropertySheetTC::test_chmod
====== 2 failed, 373 passed, 1 skipped, 140 warnings in 219.16s (0:03:39) ======
ERROR: InvocationError for command '/builds/cubicweb/cubicweb/.tox/py3-web/bin/python -m pytest /builds/cubicweb/cubicweb/cubicweb/web/test' (exited with code 1)
___________________________________ summary ____________________________________
ERROR: py3-web: commands failed
Running after_script
Uploading artifacts for failed job
ERROR: Job failed: command terminated with exit code 1